Target
DNA-(apurinic or apyrimidinic site) endonuclease
Ligand
BDBM26606
Substrate
DNA Substrate
Meas. Tech.
APE1 Inhibition Assay
IC50
5000±n/a nM
Citation
 Zawahir, ZDayam, RDeng, JPereira, CNeamati, N Pharmacophore guided discovery of small-molecule human apurinic/apyrimidinic endonuclease 1 inhibitors. J Med Chem 52:20-32 (2009)  
Target
Name:
DNA-(apurinic or apyrimidinic site) endonuclease
Synonyms:
APE APEX APEX1_HUMAN Apurinic-apyrimidinic endonuclease 1 (APE-1) DNA-(apurinic or apyrimidinic site) lyase REF1
Type:
Protein
Mol. Mass.:
35560.12
Organism:
Homo sapiens (Human)
Description:
P27695
Residue:
318
  
Inhibitor
Name:
BDBM26606
Synonyms:
5-{[(2-{[(4-carboxy-5-methylfuran-2-yl)methyl]sulfanyl}ethyl)sulfanyl]methyl}-2-methylfuran-3-carboxylic acid | furan carboxylic acid analogue, 31
Type:
Small organic molecule
Emp. Form.:
C16H18O6S2
Mol. Mass.:
370.441
SMILES:
Cc1oc(CSCCSCc2cc(C(O)=O)c(C)o2)cc1C(O)=O
:
Substrate
Name:
DNA Substrate
Synonyms:
Annealed double-stranded oligonucleotide with an abasic site
Type:
Radiolabeled substrate
Mol. Mass.:
2306.64
Organism:
Description:
The top strand is 5-ATTTCACCGGTACG(F)TCTAGAATCC-3 containing the tetrahydrofuran synthetic abasic residue (F). It is radiolabeled with gamma-32P.
Residue:
26