Target
TGF-beta receptor type-2
Ligand
BDBM387329
Substrate
IC50
950±n/a nM
Citation
 Borzilleri, RMFink, BEHarikrishnan, LSSankara Warrier, J TGF beta receptor antagonists US Patent  US10292985 Publication Date 5/21/2019 
Target
Name:
TGF-beta receptor type-2
Synonyms:
TGF-beta receptor type II TGFR2_HUMAN
Type:
PROTEIN
Mol. Mass.:
64559.49
Organism:
Homo sapiens (Human)
Description:
ChEMBL_586859
Residue:
567
  
Inhibitor
Name:
BDBM387329
Synonyms:
7-methoxy-N-[2-(6-methylpyridin-2-yl)pyrrolo[2,1-f][1,2,4]triazin-4-yl]quinolin-4-amine | US10292985, Example 13
Type:
Small organic molecule
Emp. Form.:
C22H18N6O
Mol. Mass.:
382.4179
SMILES:
COc1ccc2c(Nc3nc(nn4cccc34)-c3cccc(C)n3)ccnc2c1
: