Target
TGF-beta receptor type-1
Ligand
BDBM387348
Substrate
Meas. Tech.
Biological Assays
IC50
67.0±n/a nM
Citation
 Borzilleri, RMFink, BEHarikrishnan, LSSankara Warrier, J TGF beta receptor antagonists US Patent  US10292985 Publication Date 5/21/2019 
Target
Name:
TGF-beta receptor type-1
Synonyms:
ALK-5 Activin A receptor type II-like protein kinase of 53kD SKR4 TGF-beta receptor type I TGFBR1 TGFR1_HUMAN Transforming growth factor-beta receptor type I
Type:
enzyme
Mol. Mass.:
55968.24
Organism:
Homo sapiens (Human)
Description:
P36897
Residue:
503
  
Inhibitor
Name:
BDBM387348
Synonyms:
2-methoxy-6-(4-{1H-pyrazolo[4,3-c]pyridin-1-yl}pyrrolo[2,1-f][1,2,4]triazin-2-yl)pyridine | US10292985, Example 30
Type:
Small organic molecule
Emp. Form.:
C18H13N7O
Mol. Mass.:
343.3421
SMILES:
COc1cccc(n1)-c1nc(-n2ncc3cnccc23)c2cccn2n1
: