Target
Serine/threonine-protein kinase pim-1
Ligand
BDBM26639
Substrate
S6 kinase/Rsk-2 peptide 2
Meas. Tech.
Pim Kinase Assay
pH
7±n/a
Temperature
298.15±n/a K
IC50
6000±1700 nM
Citation
 Xia, ZKnaak, CMa, JBeharry, ZMMcInnes, CWang, WKraft, ASSmith, CD Synthesis and evaluation of novel inhibitors of Pim-1 and Pim-2 protein kinases. J Med Chem 52:74-86 (2009)  
Target
Name:
Serine/threonine-protein kinase pim-1
Synonyms:
PIM-1 Kinase PIM1_HUMAN Serine/threonine-protein kinase (PIM1) Serine/threonine-protein kinase PIM1 | Serine/threonine-protein kinase pim-1 (PIM1)
Type:
Protein
Mol. Mass.:
35681.82
Organism:
Homo sapiens (Human)
Description:
P11309
Residue:
313
  
Inhibitor
Name:
BDBM26639
Synonyms:
(5Z)-5-{[4-(dimethylamino)phenyl]methylidene}-1,3-thiazolidine-2,4-dione | thiazolidine-2,4-dione, 17a
Type:
Small organic molecule
Emp. Form.:
C12H12N2O2S
Mol. Mass.:
248.301
SMILES:
CN(C)c1ccc(C=C2SC(O)=NC2=O)cc1
:
Substrate
Name:
S6 kinase/Rsk-2 peptide 2
Synonyms:
Type:
Peptide
Mol. Mass.:
1149.41
Organism:
Description:
Residue:
9
KKRNRTLTK