Target
Indoleamine 2,3-dioxygenase 1
Ligand
BDBM387444
Substrate
Meas. Tech.
In-vitro IDO1 Enzyme (Indoleamine 2,3-dioxygenase) Assay
IC50
<200±n/a nM
Citation
 Banerjee, MMiddya, SShrivastava, RRaina, SSurya, AYadav, DBYadav, VKKapoor, KKVenkatesan, ASmith, RAThompson, SK Inhibitors of the kynurenine pathway US Patent  US10294212 Publication Date 5/21/2019 
Target
Name:
Indoleamine 2,3-dioxygenase 1
Synonyms:
I23O1_HUMAN IDO-1 INDO Indoleamine 2,3-dioxygenase | Indoleamine-pyrrole 2,3-dioxygenase
Type:
Enzyme
Mol. Mass.:
45330.80
Organism:
Homo sapiens (Human)
Description:
P14902
Residue:
403
  
Inhibitor
Name:
BDBM387444
Synonyms:
7-Propyl-N3-(3- (trifluoro- methyl)phenyl) furo[2,3-c] pyridine- 2,3-diamine | US10294212, No. 78
Type:
Small organic molecule
Emp. Form.:
C17H16F3N3O
Mol. Mass.:
335.3236
SMILES:
CCCc1nccc2c(Nc3cccc(c3)C(F)(F)F)c(N)oc12
: