Target
Melanocortin receptor 4
Ligand
BDBM387707
Substrate
Meas. Tech.
LANCE Assay
EC50
398±n/a nM
Citation
 Cone, RDBishop, MJStewart, ELWolfe, LAPantel, JSebag, JWeaver, CDWilliams, SCox, HTough, IGimenez, LDBaskaran, S Positive allosteric modulators of human melanocortin-4 receptor US Patent  US10294214 Publication Date 5/21/2019 
Target
Name:
Melanocortin receptor 4
Synonyms:
MC4-R MC4R_HUMAN Melanocortin receptor 4 (MC-4) Melanocortin receptor 4 (MC4R)
Type:
Enzyme
Mol. Mass.:
36949.50
Organism:
Homo sapiens (Human)
Description:
P32245
Residue:
332
  
Inhibitor
Name:
BDBM387707
Synonyms:
US10294214, Example 7
Type:
Small organic molecule
Emp. Form.:
C21H25BrN3O2
Mol. Mass.:
431.346
SMILES:
CC1(C)CCCN(CC(=O)Nc2c(nc3ccc(Br)cc23)C(=O)C2CC2)C1
: