Target
Melanocortin receptor 4
Ligand
BDBM387708
Substrate
Meas. Tech.
LANCE Assay
EC50
316±n/a nM
Citation
 Cone, RDBishop, MJStewart, ELWolfe, LAPantel, JSebag, JWeaver, CDWilliams, SCox, HTough, IGimenez, LDBaskaran, S Positive allosteric modulators of human melanocortin-4 receptor US Patent  US10294214 Publication Date 5/21/2019 
Target
Name:
Melanocortin receptor 4
Synonyms:
MC4-R MC4R_HUMAN Melanocortin receptor 4 (MC-4) Melanocortin receptor 4 (MC4R)
Type:
Enzyme
Mol. Mass.:
36949.50
Organism:
Homo sapiens (Human)
Description:
P32245
Residue:
332
  
Inhibitor
Name:
BDBM387708
Synonyms:
US10294214, Example 8
Type:
Small organic molecule
Emp. Form.:
C25H25BrN3O2
Mol. Mass.:
479.389
SMILES:
Brc1ccc2nc(C(=O)C3CC3)c(NC(=O)CN3CCC(CC3)c3ccccc3)c2c1
: