Target
Melanocortin receptor 4
Ligand
BDBM387757
Substrate
Meas. Tech.
LANCE Assay
EC50
2512±n/a nM
Citation
 Cone, RDBishop, MJStewart, ELWolfe, LAPantel, JSebag, JWeaver, CDWilliams, SCox, HTough, IGimenez, LDBaskaran, S Positive allosteric modulators of human melanocortin-4 receptor US Patent  US10294214 Publication Date 5/21/2019 
Target
Name:
Melanocortin receptor 4
Synonyms:
MC4-R MC4R_HUMAN Melanocortin receptor 4 (MC-4) Melanocortin receptor 4 (MC4R)
Type:
Enzyme
Mol. Mass.:
36949.50
Organism:
Homo sapiens (Human)
Description:
P32245
Residue:
332
  
Inhibitor
Name:
BDBM387757
Synonyms:
US10294214, Example 57
Type:
Small organic molecule
Emp. Form.:
C25H29N4O3
Mol. Mass.:
433.5228
SMILES:
COC(=O)c1nc2ccccc2c1NC(=O)CN1CCN(Cc2ccccc2)C(C)(C)C1
: