Target
Melanocortin receptor 4
Ligand
BDBM387765
Substrate
Meas. Tech.
LANCE Assay
EC50
316±n/a nM
Citation
 Cone, RDBishop, MJStewart, ELWolfe, LAPantel, JSebag, JWeaver, CDWilliams, SCox, HTough, IGimenez, LDBaskaran, S Positive allosteric modulators of human melanocortin-4 receptor US Patent  US10294214 Publication Date 5/21/2019 
Target
Name:
Melanocortin receptor 4
Synonyms:
MC4-R MC4R_HUMAN Melanocortin receptor 4 (MC-4) Melanocortin receptor 4 (MC4R)
Type:
Enzyme
Mol. Mass.:
36949.50
Organism:
Homo sapiens (Human)
Description:
P32245
Residue:
332
  
Inhibitor
Name:
BDBM387765
Synonyms:
US10294214, Example 65
Type:
Small organic molecule
Emp. Form.:
C24H30N3O2
Mol. Mass.:
392.5139
SMILES:
O=C(CN1CCC2(CCCCC2)CC1)Nc1c(nc2ccccc12)C(=O)C1CC1
: