Target
Prostaglandin E2 receptor EP2 subtype
Ligand
BDBM263344
Substrate
Prostaglandin E2 receptor EP4 subtype (EP4)
Meas. Tech.
FLIPR Assay
pH
7.4±n/a
Ki
14±n/a nM
EC50
29±n/a nM
Comments
extracted
Citation
 Donde, YNguyen, JH Compounds and methods for skin repair US Patent  US9546162 Publication Date 1/17/2017 
Target
Name:
Prostaglandin E2 receptor EP2 subtype
Synonyms:
PE2R2_HUMAN PTGER2 Prostaglandin E2 receptor Prostanoid EP2 Receptor
Type:
Enzyme
Mol. Mass.:
39775.71
Organism:
Homo sapiens (Human)
Description:
P43116
Residue:
358
  
Inhibitor
Name:
BDBM263344
Synonyms:
US9546162, 2
Type:
Small organic molecule
Emp. Form.:
C24H22FNO2
Mol. Mass.:
375.4354
SMILES:
OC(=O)c1ccc(CCc2cccc3CCN(Cc4ccc(F)cc4)c23)cc1
:
Substrate
Name:
Prostaglandin E2 receptor EP4 subtype
Synonyms:
PE2R4_HUMAN PGE2 receptor EP4 subtype PTGER4 Prostanoid EP4 receptor
Type:
Enzyme
Mol. Mass.:
53134.53
Organism:
Homo sapiens (Human)
Description:
P35408
Residue:
488