Target
Prostaglandin E2 receptor EP4 subtype
Ligand
BDBM263356
Substrate
Prostaglandin E2 receptor EP4 subtype (EP4)
Meas. Tech.
FLIPR Assay
pH
7.4±n/a
Ki
714±n/a nM
Comments
extracted
Citation
 Donde, YNguyen, JH Compounds and methods for skin repair US Patent  US9546162 Publication Date 1/17/2017 
Target
Name:
Prostaglandin E2 receptor EP4 subtype
Synonyms:
PE2R4_HUMAN PGE2 receptor EP4 subtype PTGER4 Prostanoid EP4 receptor
Type:
Enzyme
Mol. Mass.:
53134.53
Organism:
Homo sapiens (Human)
Description:
P35408
Residue:
488
  
Inhibitor
Name:
BDBM263356
Synonyms:
US9546162, 14
Type:
Small organic molecule
Emp. Form.:
C23H23NO3S
Mol. Mass.:
393.499
SMILES:
COc1cccc(CN2CCc3cccc(CCc4ccc(s4)C(O)=O)c23)c1
:
Substrate
Name:
Prostaglandin E2 receptor EP4 subtype
Synonyms:
PE2R4_HUMAN PGE2 receptor EP4 subtype PTGER4 Prostanoid EP4 receptor
Type:
Enzyme
Mol. Mass.:
53134.53
Organism:
Homo sapiens (Human)
Description:
P35408
Residue:
488