Target
Prostaglandin E2 receptor EP2 subtype
Ligand
BDBM263348
Substrate
Prostaglandin E2 receptor EP4 subtype (EP4)
Meas. Tech.
Radioligand Binding Assay
pH
7.4±n/a
Ki
53±n/a nM
Comments
extracted
Citation
 Donde, YNguyen, JH Compounds and methods for skin repair US Patent  US9546162 Publication Date 1/17/2017 
Target
Name:
Prostaglandin E2 receptor EP2 subtype
Synonyms:
PE2R2_HUMAN PTGER2 Prostaglandin E2 receptor Prostanoid EP2 Receptor
Type:
Enzyme
Mol. Mass.:
39775.71
Organism:
Homo sapiens (Human)
Description:
P43116
Residue:
358
  
Inhibitor
Name:
BDBM263348
Synonyms:
US9546162, 6
Type:
Small organic molecule
Emp. Form.:
C28H25NO2
Mol. Mass.:
407.5036
SMILES:
OC(=O)c1ccc(CCc2cccc3CCN(Cc4ccc5ccccc5c4)c23)cc1
:
Substrate
Name:
Prostaglandin E2 receptor EP4 subtype
Synonyms:
PE2R4_HUMAN PGE2 receptor EP4 subtype PTGER4 Prostanoid EP4 receptor
Type:
Enzyme
Mol. Mass.:
53134.53
Organism:
Homo sapiens (Human)
Description:
P35408
Residue:
488