Target
Prostaglandin E2 receptor EP4 subtype
Ligand
BDBM263349
Substrate
Prostaglandin E2 receptor EP4 subtype (EP4)
Meas. Tech.
Radioligand Binding Assay
pH
7.4±n/a
Ki
34±n/a nM
EC50
33±n/a nM
Comments
extracted
Citation
 Donde, YNguyen, JH Compounds and methods for skin repair US Patent  US9546162 Publication Date 1/17/2017 
Target
Name:
Prostaglandin E2 receptor EP4 subtype
Synonyms:
PE2R4_HUMAN PGE2 receptor EP4 subtype PTGER4 Prostanoid EP4 receptor
Type:
Enzyme
Mol. Mass.:
53134.53
Organism:
Homo sapiens (Human)
Description:
P35408
Residue:
488
  
Inhibitor
Name:
BDBM263349
Synonyms:
US9546162, 7
Type:
Small organic molecule
Emp. Form.:
C38H35NO4
Mol. Mass.:
569.6888
SMILES:
OC(=O)c1ccc(CCc2cccc3CCN(Cc4cc(OCc5ccccc5)cc(OCc5ccccc5)c4)c23)cc1
:
Substrate
Name:
Prostaglandin E2 receptor EP4 subtype
Synonyms:
PE2R4_HUMAN PGE2 receptor EP4 subtype PTGER4 Prostanoid EP4 receptor
Type:
Enzyme
Mol. Mass.:
53134.53
Organism:
Homo sapiens (Human)
Description:
P35408
Residue:
488