Target
Prostaglandin E2 receptor EP4 subtype
Ligand
BDBM263354
Substrate
Prostaglandin E2 receptor EP4 subtype (EP4)
Meas. Tech.
Radioligand Binding Assay
pH
7.4±n/a
Ki
52±n/a nM
EC50
41±n/a nM
Comments
extracted
Citation
 Donde, YNguyen, JH Compounds and methods for skin repair US Patent  US9546162 Publication Date 1/17/2017 
Target
Name:
Prostaglandin E2 receptor EP4 subtype
Synonyms:
PE2R4_HUMAN PGE2 receptor EP4 subtype PTGER4 Prostanoid EP4 receptor
Type:
Enzyme
Mol. Mass.:
53134.53
Organism:
Homo sapiens (Human)
Description:
P35408
Residue:
488
  
Inhibitor
Name:
BDBM263354
Synonyms:
US9546162, 12
Type:
Small organic molecule
Emp. Form.:
C25H25NO4
Mol. Mass.:
403.4703
SMILES:
COc1cc(OC)cc(c1)N1Cc2cccc(CCc3ccc(cc3)C(O)=O)c2C1
:
Substrate
Name:
Prostaglandin E2 receptor EP4 subtype
Synonyms:
PE2R4_HUMAN PGE2 receptor EP4 subtype PTGER4 Prostanoid EP4 receptor
Type:
Enzyme
Mol. Mass.:
53134.53
Organism:
Homo sapiens (Human)
Description:
P35408
Residue:
488