Target
Fatty-acid amide hydrolase 1 [30-579]
Ligand
BDBM26716
Substrate
BDBM22988
Meas. Tech.
FAAH Carbon Filtration Assay
pH
8±n/a
Temperature
295.15±n/a K
IC50
>10000±n/a nM
Citation
 Wang, XSarris, KKage, KZhang, DBrown, SPKolasa, TSurowy, CEl Kouhen, OFMuchmore, SWBrioni, JDStewart, AO Synthesis and evaluation of benzothiazole-based analogues as novel, potent, and selective fatty acid amide hydrolase inhibitors. J Med Chem 52:170-80 (2009)  
Target
Name:
Fatty-acid amide hydrolase 1 [30-579]
Synonyms:
Anandamide amidohydrolase 1 Faah Fatty Acid Amide Hydrolase Fatty-acid amide hydrolase (FAAH) Fatty-acid amide hydrolase 1 (FAAH) Oleamide hydrolase 1
Type:
Single-pass membrane protein; homodimer
Mol. Mass.:
60474.00
Organism:
Rattus norvegicus (rat)
Description:
P97612 (aa 30-579)
Residue:
550
  
Inhibitor
Name:
BDBM26716
Synonyms:
1-[(4-chlorobenzene)sulfonyl]-N-[4-(6-methyl-1,3-benzothiazol-2-yl)phenyl]piperidine-4-carboxamide | benzothiazole analogue, 13h
Type:
Small organic molecule
Emp. Form.:
C26H24ClN3O3S2
Mol. Mass.:
526.07
SMILES:
Cc1ccc2nc(sc2c1)-c1ccc(NC(=O)C2CCN(CC2)S(=O)(=O)c2ccc(Cl)cc2)cc1
:
Substrate
Name:
BDBM22988
Synonyms:
(5Z,8Z,11Z,14Z)-N-(2-hydroxyethyl)icosa-5,8,11,14-tetraenamide ANANDAMIDE Arachidonoyl ethanolamide (AEA) Arachidonylethanolamide [14C]Anandamide | [3H]Anandamide
Type:
radiolabeled substrate
Emp. Form.:
C22H37NO2
Mol. Mass.:
347.5347
SMILES:
CCCCC\C=C/C\C=C/C\C=C/C\C=C/CCCC(=O)NCCO
: