Target
Muscarinic acetylcholine receptor M1
Ligand
BDBM387801
Substrate
Meas. Tech.
Determination of Allosteric Potency EC50 Values for Muscarinic M1 Receptor
EC50
2920±n/a nM
Citation
 Nirogi, RShinde, AKMohammed, ARSubramanian, RBenade, VSBhyrapuneni, GJasti, V Fluoroindole derivatives as muscarinic M1 receptor positive allosteric modulators US Patent  US10294217 Publication Date 5/21/2019 
Target
Name:
Muscarinic acetylcholine receptor M1
Synonyms:
ACM1_HUMAN Cholinergic receptor, muscarinic 1 | Cholinergic, muscarinic M1
Type:
Protein
Mol. Mass.:
51442.54
Organism:
Homo sapiens (Human)
Description:
P11229
Residue:
460
  
Inhibitor
Name:
BDBM387801
Synonyms:
US10294217, Example 28 | US10294217, Example 29
Type:
Small organic molecule
Emp. Form.:
C20H18ClF3N4O
Mol. Mass.:
422.831
SMILES:
FC1CNCCC1NC(=O)c1cn(Cc2ccnc(Cl)c2)c2c(F)ccc(F)c12
: