Target
Cyclin-T1/Cyclin-dependent kinase 9
Ligand
BDBM316239
Substrate
Meas. Tech.
In Vitro CDK9/CyclinT Assay
IC50
>10000±n/a nM
Citation
 Lori, FChafouleas, JDe Forni, DSolinas, AVarga, ZGreff, ZÕrfi, LKéri, G 4,6-disubstituted aminopyrimidine derivatives have anti-HIV activity US Patent  US10294218 Publication Date 5/21/2019 
Target
Name:
Cyclin-T1/Cyclin-dependent kinase 9
Synonyms:
CDK9/ Cyclin-T1 CDK9/Cyclin T Cyclin T1/dependent kinase 9 | Cyclin-Dependent Kinase 9 (CDK9)
Type:
Protein Complex
Mol. Mass.:
Description:
Components:
This complex has 2 components.
Component 1
Name:
Cyclin-T1
Synonyms:
CCNT1 CycT Cyclin T Cyclin-T
Type:
Enzyme Subunit
Mol. Mass.:
80712.40
Organism:
Homo sapiens (Human)
Description:
Residue:
726
  
Component 2
Name:
Cyclin-dependent kinase 9
Synonyms:
C-2K CDK9 Cell division cycle 2-like protein kinase 4 Cyclin-Dependent Kinase 9 (CDK9) Serine/threonine-protein kinase PITALRE Tat-associated kinase complex catalytic subunit
Type:
Enzyme Subunit
Mol. Mass.:
42789.13
Organism:
Homo sapiens (Human)
Description:
Residue:
372
  
Inhibitor
Name:
BDBM316239
Synonyms:
(4-Methoxy-3-nitro-phenyl)-[6-(3-methoxy-phenyl)-pyrimidin-4-yl]-amine US9617225, Example 67
Type:
Small organic molecule
Emp. Form.:
C18H16N4O4
Mol. Mass.:
352.344
SMILES:
COc1cccc(c1)-c1cc(Nc2ccc(OC)c(c2)[N+]([O-])=O)ncn1
: