Target
Cyclin-T1/Cyclin-dependent kinase 9
Ligand
BDBM316261
Substrate
Meas. Tech.
In Vitro CDK9/CyclinT Assay
IC50
<1000±n/a nM
Citation
 Lori, FChafouleas, JDe Forni, DSolinas, AVarga, ZGreff, ZÕrfi, LKéri, G 4,6-disubstituted aminopyrimidine derivatives have anti-HIV activity US Patent  US10294218 Publication Date 5/21/2019 
Target
Name:
Cyclin-T1/Cyclin-dependent kinase 9
Synonyms:
CDK9/ Cyclin-T1 CDK9/Cyclin T Cyclin T1/dependent kinase 9 | Cyclin-Dependent Kinase 9 (CDK9)
Type:
Protein Complex
Mol. Mass.:
Description:
Components:
This complex has 2 components.
Component 1
Name:
Cyclin-T1
Synonyms:
CCNT1 CycT Cyclin T Cyclin-T
Type:
Enzyme Subunit
Mol. Mass.:
80712.40
Organism:
Homo sapiens (Human)
Description:
Residue:
726
  
Component 2
Name:
Cyclin-dependent kinase 9
Synonyms:
C-2K CDK9 Cell division cycle 2-like protein kinase 4 Cyclin-Dependent Kinase 9 (CDK9) Serine/threonine-protein kinase PITALRE Tat-associated kinase complex catalytic subunit
Type:
Enzyme Subunit
Mol. Mass.:
42789.13
Organism:
Homo sapiens (Human)
Description:
Residue:
372
  
Inhibitor
Name:
BDBM316261
Synonyms:
N1-[6-(2-Ethoxy-4-fluoro-phenyl)-pyrimidin-4-yl]-5-fluoro-4-methoxy-benzene-1,3-diamine US9617225, Example 89
Type:
Small organic molecule
Emp. Form.:
C19H18F2N4O2
Mol. Mass.:
372.3686
SMILES:
CCOc1cc(F)ccc1-c1cc(Nc2cc(N)c(OC)c(F)c2)ncn1
: