Target
Cyclin-T1/Cyclin-dependent kinase 9
Ligand
BDBM316289
Substrate
Meas. Tech.
In Vitro CDK9/CyclinT Assay
IC50
<1000±n/a nM
Citation
 Lori, FChafouleas, JDe Forni, DSolinas, AVarga, ZGreff, ZÕrfi, LKéri, G 4,6-disubstituted aminopyrimidine derivatives have anti-HIV activity US Patent  US10294218 Publication Date 5/21/2019 
Target
Name:
Cyclin-T1/Cyclin-dependent kinase 9
Synonyms:
CDK9/ Cyclin-T1 CDK9/Cyclin T Cyclin T1/dependent kinase 9 | Cyclin-Dependent Kinase 9 (CDK9)
Type:
Protein Complex
Mol. Mass.:
Description:
Components:
This complex has 2 components.
Component 1
Name:
Cyclin-T1
Synonyms:
CCNT1 CycT Cyclin T Cyclin-T
Type:
Enzyme Subunit
Mol. Mass.:
80712.40
Organism:
Homo sapiens (Human)
Description:
Residue:
726
  
Component 2
Name:
Cyclin-dependent kinase 9
Synonyms:
C-2K CDK9 Cell division cycle 2-like protein kinase 4 Cyclin-Dependent Kinase 9 (CDK9) Serine/threonine-protein kinase PITALRE Tat-associated kinase complex catalytic subunit
Type:
Enzyme Subunit
Mol. Mass.:
42789.13
Organism:
Homo sapiens (Human)
Description:
Residue:
372
  
Inhibitor
Name:
BDBM316289
Synonyms:
N-{5-[6-(4-Fluoro-2-methoxy-phenyl)-pyrimidin-4-ylamino]-2-methoxy-phenyl}-acetamide US9617225, Example 117
Type:
Small organic molecule
Emp. Form.:
C20H19FN4O3
Mol. Mass.:
382.3883
SMILES:
COc1ccc(Nc2cc(ncn2)-c2ccc(F)cc2OC)cc1NC(C)=O
: