Target
Interleukin-1 beta
Ligand
BDBM77015
Substrate
Meas. Tech.
cytomteric bead array (CBA) assay
Temperature
310.15±n/a K
IC50
6.20±n/a nM
Comments
extracted
Citation
 Gandhi, ADimartino, JChopra, R Methods for the treatment of locally advanced breast cancer US Patent  US9694015 Publication Date 7/4/2017 
Target
Name:
Interleukin-1 beta
Synonyms:
IL1B IL1F2 Interleukin-1 beta | hIL-1beta
Type:
Cytokine
Mol. Mass.:
30734.47
Organism:
Homo sapiens (Human)
Description:
P01584
Residue:
269
  
Inhibitor
Name:
BDBM77015
Synonyms:
(R)-3-(4-((4-(morpholinomethyl)benzyl)-oxy)-1-oxoisoindolin-2-yl)piperidine-2,6-dione | US9694015, 6.4R
Type:
Small organic molecule
Emp. Form.:
C25H27N3O5
Mol. Mass.:
449.499
SMILES:
O=C1N(Cc2c1cccc2OCc1ccc(CN2CCOCC2)cc1)[C@@H]1CCC(=O)NC1=O
: