Target
Tumor necrosis factor
Ligand
BDBM77008
Substrate
Meas. Tech.
cytomteric bead array (CBA) assay
Temperature
310.15±n/a K
IC50
0.79±n/a nM
Comments
extracted
Citation
 Gandhi, ADimartino, JChopra, R Methods for the treatment of locally advanced breast cancer US Patent  US9694015 Publication Date 7/4/2017 
Target
Name:
Tumor necrosis factor
Synonyms:
Cachectin TNF-a TNFA TNFSF2 Tumor necrosis factor (TNFa) Tumor necrosis factor ligand superfamily member 2 Tumor necrosis factor, soluble form | tumor necrosis factor alpha
Type:
Enzyme
Mol. Mass.:
25645.11
Organism:
Homo sapiens (Human)
Description:
P01375
Residue:
233
  
Inhibitor
Name:
BDBM77008
Synonyms:
3-{4-[4-(2-morpholin-4-yl-ethyl)-benzyloxy]-1-oxo-1,3-dihydro-isoindol-2-yl}-piperidine-2,6-dione | US9694015, 6.7
Type:
Small organic molecule
Emp. Form.:
C26H29N3O5
Mol. Mass.:
463.5256
SMILES:
O=C1N(Cc2c1cccc2OCc1ccc(CCN2CCOCC2)cc1)C1CCC(=O)NC1=O
: