Target
Sodium channel protein type 5 subunit alpha
Ligand
BDBM71061
Substrate
Meas. Tech.
Radioligand Binding Assay (EP) (In vitro Assay)
pH
7.4±n/a
Temperature
298.15±n/a K
IC50
1.80±n/a nM
Comments
extracted
Citation
 Andrez, JBichler, PRChen, CChowdhury, SDecker, SMDehnhardt, CMFocken, TGrimwood, MEHemeon, IWJia, QLi, JLiu, ZOrtwine, DFSafina, BSutherlin, DSheng, TSun, SWhite, ADWilson, MSZenova, AYZhu, J Substituted benzamides and methods of use thereof US Patent  US9546164 Publication Date 1/17/2017 
Target
Name:
Sodium channel protein type 5 subunit alpha
Synonyms:
HH1 SCN5A_HUMAN Sodium channel protein type 5 subunit alpha/beta-1/beta-2 Voltage-gated sodium channel subunit alpha Nav1.5
Type:
Enzyme
Mol. Mass.:
226908.60
Organism:
Homo sapiens (Human)
Description:
Q14524
Residue:
2016
  
Inhibitor
Name:
BDBM71061
Synonyms:
US9546164, 206 | US9694002, 206
Type:
Small organic molecule
Emp. Form.:
C28H35Cl2FN2O5S
Mol. Mass.:
601.557
SMILES:
COC(C)(C)[C@@H](N1CCC(COc2cc(F)c(cc2C2CC2)C(=O)NS(C)(=O)=O)CC1)c1cc(Cl)cc(Cl)c1
: