Target
Sodium channel protein type 5 subunit alpha
Ligand
BDBM71340
Substrate
Meas. Tech.
Radioligand Binding Assay (EP) (In vitro Assay)
pH
7.4±n/a
Temperature
298.15±n/a K
IC50
0.800±n/a nM
Comments
extracted
Citation
 Andrez, JBichler, PRChen, CChowdhury, SDecker, SMDehnhardt, CMFocken, TGrimwood, MEHemeon, IWJia, QLi, JLiu, ZOrtwine, DFSafina, BSutherlin, DSheng, TSun, SWhite, ADWilson, MSZenova, AYZhu, J Substituted benzamides and methods of use thereof US Patent  US9546164 Publication Date 1/17/2017 
Target
Name:
Sodium channel protein type 5 subunit alpha
Synonyms:
HH1 SCN5A_HUMAN Sodium channel protein type 5 subunit alpha/beta-1/beta-2 Voltage-gated sodium channel subunit alpha Nav1.5
Type:
Enzyme
Mol. Mass.:
226908.60
Organism:
Homo sapiens (Human)
Description:
Q14524
Residue:
2016
  
Inhibitor
Name:
BDBM71340
Synonyms:
US9546164, 411 | US9694002, 411
Type:
Small organic molecule
Emp. Form.:
C32H33Cl2FN2O4S
Mol. Mass.:
631.585
SMILES:
Fc1cc(OCC2CCN(CC2)C(c2ccccc2)c2cc(Cl)cc(Cl)c2)c(cc1C(=O)NS(=O)(=O)C1CC1)C1CC1
: