Target
Matrilysin
Ligand
BDBM26791
Substrate
MMP Substrate Peptide
Meas. Tech.
Enzyme Inhibition Assay
pH
7.5±n/a
Temperature
298.15±n/a K
Ki
5858±n/a nM
Citation
 Ott, GRAsakawa, NLu, ZAnand, RLiu, RQCovington, MBVaddi, KQian, MNewton, RCChrist, DDTrzaskos, JMDuan, JJ Potent, exceptionally selective, orally bioavailable inhibitors of TNF-alpha Converting Enzyme (TACE): novel 2-substituted-1H-benzo[d]imidazol-1-yl)methyl)benzamide P1' substituents. Bioorg Med Chem Lett 18:1577-82 (2008)  
Target
Name:
Matrilysin
Synonyms:
MMP7 MPSL1 Matrix metalloproteinase-7 (MMP-7) PUMP1
Type:
Enzyme
Mol. Mass.:
29681.54
Organism:
Homo sapiens (Human)
Description:
P09237
Residue:
267
  
Inhibitor
Name:
BDBM26791
Synonyms:
benzimidazole analog., 17 | tert-butyl (3S,4S)-3-(hydroxycarbamoyl)-4-({4-[(2-methyl-1H-1,3-benzodiazol-1-yl)methyl]benzene}amido)pyrrolidine-1-carboxylate
Type:
Small organic molecule
Emp. Form.:
C26H31N5O5
Mol. Mass.:
493.5548
SMILES:
Cc1nc2ccccc2n1Cc1ccc(cc1)C(=O)N[C@@H]1CN(C[C@@H]1C(=O)NO)C(=O)OC(C)(C)C
:
Substrate
Name:
MMP Substrate Peptide
Synonyms:
Type:
Fluorogenic Peptide
Mol. Mass.:
2468.31
Organism:
Description:
MCA, (7-methoxycoumarin-4-yl)acetyl. Dpa, N-3-(2,4-dinitrophenyl)-L-2,3-diaminopropionyl.
Residue:
23