Target
Glutaminase kidney isoform, mitochondrial
Ligand
BDBM278400
Substrate
Meas. Tech.
GLS Enzyme Potency Assay
IC50
21.3±n/a nM
Citation
 Finlay, MREkwuru, CTCharles, MDRaubo, PAWinter, JJNissink, JW 1, 3, 4-thiadiazole compounds and their use in treating cancer US Patent  US10294221 Publication Date 5/21/2019 
Target
Name:
Glutaminase kidney isoform, mitochondrial
Synonyms:
GLS GLSK_HUMAN K-glutaminase L-glutamine amidohydrolase
Type:
Protein
Mol. Mass.:
73471.89
Organism:
Homo sapiens (Human)
Description:
O94925
Residue:
669
  
Inhibitor
Name:
BDBM278400
Synonyms:
(2S)-2-Methoxy-2-phenyl-N-[5-[[(3R)-1-pyridazin-3-ylpyrrolidin-3-yl]amino]-1,3,4-thiadiazol-2-yl]acetamide US10040788, Example 2(a) | US10294221, Example 20(b)
Type:
Small organic molecule
Emp. Form.:
C19H21N7O2S
Mol. Mass.:
411.481
SMILES:
CO[C@H](C(=O)Nc1nnc(N[C@@H]2CCN(C2)c2cccnn2)s1)c1ccccc1
: