Target
Fibroblast growth factor receptor 1
Ligand
BDBM287082
Substrate
Meas. Tech.
FGFR Family Enzymatic Activity Assay
IC50
4.40±n/a nM
Citation
 Verner, EBrameld, KA Quinolone derivatives as fibroblast growth factor receptor inhibitors US Patent  US10294223 Publication Date 5/21/2019 
Target
Name:
Fibroblast growth factor receptor 1
Synonyms:
BFGFR Basic fibroblast growth factor receptor 1 (FGFR1) CEK FGFR-1 FGFR-1, (FL) FGFR1_HUMAN FLT2 Fibroblast growth factor receptor 1 (FGFR-1) Fms-like tyrosine kinase 2 N-sam bFGF-R | c-fgr
Type:
Receptor
Mol. Mass.:
91861.70
Organism:
Homo sapiens (Human)
Description:
P11362
Residue:
822
  
Inhibitor
Name:
BDBM287082
Synonyms:
8-(2-((1-acryloylazetidin-3-yl)oxy)-2-methylpropyl)-6-(2,6-dichloro-3,5-dimethoxyphenyl)-2-(methylamino)pyrido[2,3-d]pyrimidin-7(8H)-one US11078199, Cpd 108 US9815834, Compound 108
Type:
Small organic molecule
Emp. Form.:
C26H29Cl2N5O5
Mol. Mass.:
562.445
SMILES:
CNc1ncc2cc(-c3c(Cl)c(OC)cc(OC)c3Cl)c(=O)n(CC(C)(C)OC3CN(C3)C(=O)C=C)c2n1
: