Target
Fibroblast growth factor receptor 1
Ligand
BDBM287517
Substrate
Meas. Tech.
FGFR Family Enzymatic Activity Assay
IC50
1.40±n/a nM
Citation
 Verner, EBrameld, KA Quinolone derivatives as fibroblast growth factor receptor inhibitors US Patent  US10294223 Publication Date 5/21/2019 
Target
Name:
Fibroblast growth factor receptor 1
Synonyms:
BFGFR Basic fibroblast growth factor receptor 1 (FGFR1) CEK FGFR-1 FGFR-1, (FL) FGFR1_HUMAN FLT2 Fibroblast growth factor receptor 1 (FGFR-1) Fms-like tyrosine kinase 2 N-sam bFGF-R | c-fgr
Type:
Receptor
Mol. Mass.:
91861.70
Organism:
Homo sapiens (Human)
Description:
P11362
Residue:
822
  
Inhibitor
Name:
BDBM287517
Synonyms:
(S)-8-((1-(1-acryloylazetidin-3-yl)pyrrolidin-2-yl)methyl)-6-(2,6-dichloro-3,5-dimethoxyphenyl)-2-(methylamino)pyrido[2,3-d]pyrimidin-7(8H)-one US11078199, Cpd 113 US9815834, Compound 113
Type:
Small organic molecule
Emp. Form.:
C27H30Cl2N6O4
Mol. Mass.:
573.471
SMILES:
CNc1ncc2cc(-c3c(Cl)c(OC)cc(OC)c3Cl)c(=O)n(C[C@@H]3CCCN3C3CN(C3)C(=O)C=C)c2n1
: