Target
Fibroblast growth factor receptor 1
Ligand
BDBM287549
Substrate
Meas. Tech.
FGFR Family Enzymatic Activity Assay
IC50
9.70±n/a nM
Citation
 Verner, EBrameld, KA Quinolone derivatives as fibroblast growth factor receptor inhibitors US Patent  US10294223 Publication Date 5/21/2019 
Target
Name:
Fibroblast growth factor receptor 1
Synonyms:
BFGFR Basic fibroblast growth factor receptor 1 (FGFR1) CEK FGFR-1 FGFR-1, (FL) FGFR1_HUMAN FLT2 Fibroblast growth factor receptor 1 (FGFR-1) Fms-like tyrosine kinase 2 N-sam bFGF-R | c-fgr
Type:
Receptor
Mol. Mass.:
91861.70
Organism:
Homo sapiens (Human)
Description:
P11362
Residue:
822
  
Inhibitor
Name:
BDBM287549
Synonyms:
8-(2-((1-acryloylazetidin-3-yl)oxy)ethyl)-6-(2,6-dichloro-3,5-dimethoxyphenyl)-2-((3-(diethylamino)propyl)amino)pyrido[2,3-d]pyrimidin-7(8H)-one US11078199, Cpd 101 | US9567334, Example 101
Type:
Small organic molecule
Emp. Form.:
C30H38Cl2N6O5
Mol. Mass.:
633.566
SMILES:
CCN(CC)CCCNc1ncc2cc(-c3c(Cl)c(OC)cc(OC)c3Cl)c(=O)n(CCOC3CN(C3)C(=O)C=C)c2n1
: