Target
Fibroblast growth factor receptor 1
Ligand
BDBM387929
Substrate
Meas. Tech.
FGFR Family Enzymatic Activity Assay
IC50
1.70±n/a nM
Citation
 Verner, EBrameld, KA Quinolone derivatives as fibroblast growth factor receptor inhibitors US Patent  US10294223 Publication Date 5/21/2019 
Target
Name:
Fibroblast growth factor receptor 1
Synonyms:
BFGFR Basic fibroblast growth factor receptor 1 (FGFR1) CEK FGFR-1 FGFR-1, (FL) FGFR1_HUMAN FLT2 Fibroblast growth factor receptor 1 (FGFR-1) Fms-like tyrosine kinase 2 N-sam bFGF-R | c-fgr
Type:
Receptor
Mol. Mass.:
91861.70
Organism:
Homo sapiens (Human)
Description:
P11362
Residue:
822
  
Inhibitor
Name:
BDBM387929
Synonyms:
1-(2-((1-acryloylpiperidin-4-yl)(methyl)amino)ethyl)-3-(2,6-dichloro-3,5-dimethoxyphenyl)-7-(ethylamino)-1,6-naphthyridin-2(1H)-one US11078199, Cpd 157
Type:
Small organic molecule
Emp. Form.:
C29H35Cl2N5O4
Mol. Mass.:
588.525
SMILES:
CCNc1cc2n(CCN(C)C3CCN(CC3)C(=O)C=C)c(=O)c(cc2cn1)-c1c(Cl)c(OC)cc(OC)c1Cl
: