Target
Fibroblast growth factor receptor 2
Ligand
BDBM286383
Substrate
Meas. Tech.
Inhibition of FGFR2-Dependent Cell Growth
IC50
4.00±n/a nM
Citation
 Verner, EBrameld, KA Quinolone derivatives as fibroblast growth factor receptor inhibitors US Patent  US10294223 Publication Date 5/21/2019 
Target
Name:
Fibroblast growth factor receptor 2
Synonyms:
BEK FGFR-2 FGFR2 Fibroblast growth factor receptor 2 (FGFR2) KGFR Keratinocyte growth factor receptor VEGF-receptor 2 and Fibroblast growth factor receptor 2
Type:
Enzyme
Mol. Mass.:
92015.45
Organism:
Homo sapiens (Human)
Description:
P21802
Residue:
821
  
Inhibitor
Name:
BDBM286383
Synonyms:
8-(3-((2R,6S)-4-acryloyl-2,6-dimethylpiperazin-1-yl)propyl)-6-(2-chloro-3,5-dimethoxyphenyl)-2-(methylamino)pyrido[2,3-d]pyrimidin-7(8H)-one US11078199, Cpd 23 US9815834, Compound 23
Type:
Small organic molecule
Emp. Form.:
C28H35ClN6O4
Mol. Mass.:
555.068
SMILES:
CNc1ncc2cc(-c3cc(OC)cc(OC)c3Cl)c(=O)n(CCCN3[C@@H](C)CN(C[C@H]3C)C(=O)C=C)c2n1
: