Target
Fibroblast growth factor receptor 2
Ligand
BDBM287528
Substrate
Meas. Tech.
Inhibition of FGFR2-Dependent Cell Growth
IC50
4.20±n/a nM
Citation
 Verner, EBrameld, KA Quinolone derivatives as fibroblast growth factor receptor inhibitors US Patent  US10294223 Publication Date 5/21/2019 
Target
Name:
Fibroblast growth factor receptor 2
Synonyms:
BEK FGFR-2 FGFR2 Fibroblast growth factor receptor 2 (FGFR2) KGFR Keratinocyte growth factor receptor VEGF-receptor 2 and Fibroblast growth factor receptor 2
Type:
Enzyme
Mol. Mass.:
92015.45
Organism:
Homo sapiens (Human)
Description:
P21802
Residue:
821
  
Inhibitor
Name:
BDBM287528
Synonyms:
8-(2-((1-acryloylazetidin-3-yl)oxy)ethyl)-6-(2,6-dichloro-3,5-dimethoxyphenyl)-2-((2-(4-ethylpiperazin-1-yl)ethyl)amino)pyrido[2,3-d]pyrimidin-7(8H)-one US11078199, Cpd 94 US9815834, Compound 94
Type:
Small organic molecule
Emp. Form.:
C31H39Cl2N7O5
Mol. Mass.:
660.591
SMILES:
CCN1CCN(CCNc2ncc3cc(-c4c(Cl)c(OC)cc(OC)c4Cl)c(=O)n(CCOC4CN(C4)C(=O)C=C)c3n2)CC1
: