Target
Tyrosine-protein kinase JAK3
Ligand
BDBM387821
Substrate
Meas. Tech.
Enzymatic Inhibition Assay
IC50
96.2±n/a nM
Citation
 Koudriakova, TKreutter, KDLeonard, KRizzolio, MCSmith, RCTichenor, MSWang, A Small molecule inhibitors of the JAK family of kinases US Patent  US10294226 Publication Date 5/21/2019 
Target
Name:
Tyrosine-protein kinase JAK3
Synonyms:
JAK-3 JAK3_HUMAN Janus kinase 3 (JAK3) L-JAK | Leukocyte janus kinase
Type:
Protein
Mol. Mass.:
125111.08
Organism:
Homo sapiens (Human)
Description:
P52333
Residue:
1124
  
Inhibitor
Name:
BDBM387821
Synonyms:
N-(2-Cyanoethyl)-2-(1-((1r,4r)-4-(cyanomethyl)cyclohexyl)-1,6-dihydroimidazo[4,5-d]pyrrolo[2,3-b]pyridin-2-yl)acetamide US10487083, Example 4 US11059823, Example 4
Type:
Small organic molecule
Emp. Form.:
C21H23N7O
Mol. Mass.:
389.4536
SMILES:
O=C(Cc1nc2cnc3[nH]ccc3c2n1[C@H]1CC[C@H](CC#N)CC1)NCCC#N
: