Target
Tyrosine-protein kinase Fyn
Ligand
BDBM387846
Substrate
Meas. Tech.
Kinase Screening Assay
IC50
<10.00±n/a nM
Citation
 Unciti-Broceta, AFraser, CO. Carragher, N Compounds US Patent  US10294227 Publication Date 5/21/2019 
Target
Name:
Tyrosine-protein kinase Fyn
Synonyms:
FYN Proto-oncogene Syn SLK Src-like kinase | p59-Fyn
Type:
Enzyme
Mol. Mass.:
60762.21
Organism:
Homo sapiens (Human)
Description:
P06241
Residue:
537
  
Inhibitor
Name:
BDBM387846
Synonyms:
US10294227, Code 503
Type:
Small organic molecule
Emp. Form.:
C27H40N8O3
Mol. Mass.:
524.6583
SMILES:
COc1cc(ccc1NC(=O)OC(C)(C)C)-c1nn(CCN2CCC(CN(C)C)CC2)c2ncnc(N)c12
: