Target
Tyrosine-protein kinase Lck
Ligand
BDBM50184767
Substrate
Meas. Tech.
Kinase Screening Assay
IC50
<10.00±n/a nM
Citation
 Unciti-Broceta, AFraser, CO. Carragher, N Compounds US Patent  US10294227 Publication Date 5/21/2019 
Target
Name:
Tyrosine-protein kinase Lck
Synonyms:
2.7.10.2 LCK_HUMAN Leukocyte C-terminal Src kinase Lymphocyte-specific protein tyrosine kinase Protein YT16 Proto-oncogene tyrosine-protein kinase LCK T cell-specific protein-tyrosine kinase
Type:
Mol. Mass.:
57987.83
Organism:
Homo sapiens (Human)
Description:
P06239
Residue:
509
  
Inhibitor
Name:
BDBM50184767
Synonyms:
CHEMBL3824089 | US10294227, Code 506
Type:
Small organic molecule
Emp. Form.:
C26H38N8O3
Mol. Mass.:
510.6317
SMILES:
COc1cc(ccc1NC(=O)OC(C)(C)C)-c1nn(CCN2CCC(CC2)N(C)C)c2ncnc(N)c12
: