Target
Interleukin-1 receptor-associated kinase 4
Ligand
BDBM388193
Substrate
Meas. Tech.
IRAK4 Inhibition Assay
IC50
2.00±n/a nM
Citation
 Gardner, DSSantella, JBPaidi, VRWu, HDuncia, JVNair, SKHynes, JZhu, X Heteroaryl substituted aminopyridine compounds US Patent  US10294229 Publication Date 5/21/2019 
Target
Name:
Interleukin-1 receptor-associated kinase 4
Synonyms:
IRAK-4 IRAK4_HUMAN Interleukin-1 receptor-associated kinase 4 (IRAK4) | Renal carcinoma antigen NY-REN-64
Type:
Protein
Mol. Mass.:
51519.08
Organism:
Homo sapiens (Human)
Description:
Q9NWZ3
Residue:
460
  
Inhibitor
Name:
BDBM388193
Synonyms:
US10294229, Example 342
Type:
Small organic molecule
Emp. Form.:
C28H34N10O2
Mol. Mass.:
542.6354
SMILES:
CC(C)Nc1cc(ncc1-n1cc(nn1)C1CCC(CC1)NC(=O)OC(C)(C)C)-n1ncc2cc(cnc12)C#N
: