Target
Interleukin-1 receptor-associated kinase 4
Ligand
BDBM387898
Substrate
Meas. Tech.
IRAK4 Inhibition Assay
IC50
2.00±n/a nM
Citation
 Gardner, DSSantella, JBPaidi, VRWu, HDuncia, JVNair, SKHynes, JZhu, X Heteroaryl substituted aminopyridine compounds US Patent  US10294229 Publication Date 5/21/2019 
Target
Name:
Interleukin-1 receptor-associated kinase 4
Synonyms:
IRAK-4 IRAK4_HUMAN Interleukin-1 receptor-associated kinase 4 (IRAK4) | Renal carcinoma antigen NY-REN-64
Type:
Protein
Mol. Mass.:
51519.08
Organism:
Homo sapiens (Human)
Description:
Q9NWZ3
Residue:
460
  
Inhibitor
Name:
BDBM387898
Synonyms:
US10294229, Example 396 | US10294229, Example 52
Type:
Small organic molecule
Emp. Form.:
C20H21N9O
Mol. Mass.:
403.4404
SMILES:
CCCn1cc(nn1)-c1cnc(cc1N[C@@H](C)CO)-n1ncc2cc(cnc12)C#N
: