Target
Interleukin-1 receptor-associated kinase 4
Ligand
BDBM388266
Substrate
Meas. Tech.
IRAK4 Inhibition Assay
IC50
2.00±n/a nM
Citation
 Gardner, DSSantella, JBPaidi, VRWu, HDuncia, JVNair, SKHynes, JZhu, X Heteroaryl substituted aminopyridine compounds US Patent  US10294229 Publication Date 5/21/2019 
Target
Name:
Interleukin-1 receptor-associated kinase 4
Synonyms:
IRAK-4 IRAK4_HUMAN Interleukin-1 receptor-associated kinase 4 (IRAK4) | Renal carcinoma antigen NY-REN-64
Type:
Protein
Mol. Mass.:
51519.08
Organism:
Homo sapiens (Human)
Description:
Q9NWZ3
Residue:
460
  
Inhibitor
Name:
BDBM388266
Synonyms:
US10294229, Example 416
Type:
Small organic molecule
Emp. Form.:
C23H23N7O2
Mol. Mass.:
429.4744
SMILES:
CC(C)Nc1cc(ncc1-c1cc(no1)C1CCCOC1)-n1ncc2cc(cnc12)C#N
: