Target
Interleukin-1 receptor-associated kinase 4
Ligand
BDBM388290
Substrate
Meas. Tech.
IRAK4 Inhibition Assay
IC50
2.00±n/a nM
Citation
 Gardner, DSSantella, JBPaidi, VRWu, HDuncia, JVNair, SKHynes, JZhu, X Heteroaryl substituted aminopyridine compounds US Patent  US10294229 Publication Date 5/21/2019 
Target
Name:
Interleukin-1 receptor-associated kinase 4
Synonyms:
IRAK-4 IRAK4_HUMAN Interleukin-1 receptor-associated kinase 4 (IRAK4) | Renal carcinoma antigen NY-REN-64
Type:
Protein
Mol. Mass.:
51519.08
Organism:
Homo sapiens (Human)
Description:
Q9NWZ3
Residue:
460
  
Inhibitor
Name:
BDBM388290
Synonyms:
US10294229, Example 440 | US10294229, Example 441
Type:
Small organic molecule
Emp. Form.:
C22H25N7O2
Mol. Mass.:
419.4796
SMILES:
CCNc1cc(ncc1C1=NOC(CCC(C)(C)O)C1)-n1ncc2cc(cnc12)C#N
: