Target
D(2) dopamine receptor
Ligand
BDBM50207094
Substrate
Meas. Tech.
Receptor Binding Test
pH
7.5±n/a
Ki
0.190±n/a nM
Comments
extracted
Citation
 Li, JChen, XMa, ZZhang, LCui, N Benzoisothiazole compounds and methods of treating schizophrenia US Patent  US9550741 Publication Date 1/24/2017 
Target
Name:
D(2) dopamine receptor
Synonyms:
D(2) dopamine receptor DOPAMINE D2 Long DRD2 Dopamine D2 receptor Dopamine D2 receptor (D2R) Dopamine2-like | d2
Type:
Cell-surface receptors
Mol. Mass.:
50647.10
Organism:
Homo sapiens (Human)
Description:
P14416
Residue:
443
  
Inhibitor
Name:
BDBM50207094
Synonyms:
CHEMBL3976282 | US9550741, I-2
Type:
Small organic molecule
Emp. Form.:
C24H30N4OS2
Mol. Mass.:
454.651
SMILES:
O=C(N[C@H]1CC[C@H](CCN2CCN(CC2)c2nsc3ccccc23)CC1)c1cccs1
: