Target
Vitamin D3 receptor
Ligand
BDBM263395
Substrate
Meas. Tech.
Dopamine D3 Receptor Binding Test
Ki
0.085±n/a nM
Citation
 Li, JChen, XMa, ZZhang, LCui, N Benzoisothiazole compounds and methods of treating schizophrenia US Patent  US9550741 Publication Date 1/24/2017 
Target
Name:
Vitamin D3 receptor
Synonyms:
1,25-dihydroxyvitamin D3 receptor Nuclear receptor subfamily 1 group I member 1 VDR | VDR_HUMAN
Type:
Protein
Mol. Mass.:
48288.72
Organism:
Homo sapiens (Human)
Description:
P11473
Residue:
427
  
Inhibitor
Name:
BDBM263395
Synonyms:
US9550741, II-5
Type:
Small organic molecule
Emp. Form.:
C27H32N4O3S2
Mol. Mass.:
524.698
SMILES:
O=S(=O)(N[C@H]1CC[C@H](CCN2CCN(CC2)c2nsc3ccccc23)CC1)c1cc2ccccc2o1
: