Target
Vitamin D3 receptor
Ligand
BDBM50207110
Substrate
Meas. Tech.
Dopamine D3 Receptor Binding Test
Ki
0.460±n/a nM
Citation
 Li, JChen, XMa, ZZhang, LCui, N Benzoisothiazole compounds and methods of treating schizophrenia US Patent  US9550741 Publication Date 1/24/2017 
Target
Name:
Vitamin D3 receptor
Synonyms:
1,25-dihydroxyvitamin D3 receptor Nuclear receptor subfamily 1 group I member 1 VDR | VDR_HUMAN
Type:
Protein
Mol. Mass.:
48288.72
Organism:
Homo sapiens (Human)
Description:
P11473
Residue:
427
  
Inhibitor
Name:
BDBM50207110
Synonyms:
CHEMBL3923240 | US9550741, III-15
Type:
Small organic molecule
Emp. Form.:
C22H32N4O2S
Mol. Mass.:
416.58
SMILES:
CCOC(=O)N[C@@H]1CC[C@H](CCN2CCN(CC2)c2nsc3ccccc23)CC1
: