Target
5-hydroxytryptamine receptor 2A
Ligand
BDBM263393
Substrate
Meas. Tech.
5-HT2A Receptor Binding Test
pH
7.7±n/a
Ki
0.490±n/a nM
Comments
extracted
Citation
 Li, JChen, XMa, ZZhang, LCui, N Benzoisothiazole compounds and methods of treating schizophrenia US Patent  US9550741 Publication Date 1/24/2017 
Target
Name:
5-hydroxytryptamine receptor 2A
Synonyms:
5-HT-2 5-HT2A 5-hydroxytryptamine receptor 2A (5HT-2A) 5HT2A_HUMAN HTR2A | Serotonin receptor 2A
Type:
undefined
Mol. Mass.:
52607.65
Organism:
Homo sapiens (Human)
Description:
P28223
Residue:
471
  
Inhibitor
Name:
BDBM263393
Synonyms:
US9550741, II-3
Type:
Small organic molecule
Emp. Form.:
C23H30N4O3S2
Mol. Mass.:
474.639
SMILES:
O=S(=O)(N[C@H]1CC[C@H](CCN2CCN(CC2)c2nsc3ccccc23)CC1)c1ccco1
: