Target
Delta-type opioid receptor
Ligand
BDBM26928
Substrate
BDBM21865
Meas. Tech.
Radioligand Binding Assay
Ki
379±n/a nM
Citation
 Caldwell, JPMatasi, JJFernandez, XMcLeod, RLZhang, HFawzi, ATulshian, DB Synthesis and structure-activity relationships of N-substituted spiropiperidines as nociceptin receptor ligands: part 2. Bioorg Med Chem Lett 19:1164-7 (2009)  
Target
Name:
Delta-type opioid receptor
Synonyms:
D-OR-1 Delta opioid receptor OPIATE Delta OPRD1 OPRK1 | opioid receptor, delta 1
Type:
G Protein-Coupled Receptor (GPCR)
Mol. Mass.:
40382.98
Organism:
Homo sapiens (Human)
Description:
Competition binding assays were carried out using membrane preparations from transfected HN9.10 cells that constitutively expressed the delta opioid receptor.
Residue:
372
  
Inhibitor
Name:
BDBM26928
Synonyms:
8-[(2,6-dichlorophenyl)methyl]-3-[2-(diethylamino)ethyl]-1-phenyl-1,3,8-triazaspiro[4.5]decan-4-one | spiropiperidine analogue, 49
Type:
Small organic molecule
Emp. Form.:
C26H34Cl2N4O
Mol. Mass.:
489.48
SMILES:
CCN(CC)CCN1CN(c2ccccc2)C2(CCN(Cc3c(Cl)cccc3Cl)CC2)C1=O
:
Substrate
Name:
BDBM21865
Synonyms:
(14beta)-17-(cyclopropylmethyl)-18-(1-hydroxy-1-methylethyl)-6-methoxy-18,19-dihydro-4,5-epoxy-6,14-ethenomorphinan-3-ol CHEMBL24995 [3H]-diprenorphine
Type:
radiolabeled ligand
Emp. Form.:
C26H35NO4
Mol. Mass.:
425.5604
SMILES:
[H][C@]12Cc3ccc(O)c4OC5[C@](CCN1CC1CC1)(c34)[C@@]21CCC5(OC)C(C1)C(C)(C)O
: