Target
Glutamate receptor ionotropic, NMDA 2B
Ligand
BDBM388303
Substrate
Meas. Tech.
NR2B Antagonist Activity
IC50
38.7±n/a nM
Citation
 Shapiro, G 3,3-difluoropiperidine carbamate heterocyclic compounds as NR2B NMDA receptor antagonists US Patent  US10294230 Publication Date 5/21/2019 
Target
Name:
Glutamate receptor ionotropic, NMDA 2B
Synonyms:
GRIN2B Glutamate [NMDA] receptor subunit epsilon 2 N-methyl D-aspartate receptor subtype 2B NMDAR2B NR3 | hNR3
Type:
PROTEIN
Mol. Mass.:
166375.46
Organism:
Homo sapiens (Human)
Description:
ChEMBL_1438829
Residue:
1484
  
Inhibitor
Name:
BDBM388303
Synonyms:
US10294230, Compound E1-21.26 US11136328, Compound E1-21.26 | US11752155, Compound E1-21.26B'
Type:
Small organic molecule
Emp. Form.:
C20H24F2N4O2
Mol. Mass.:
390.427
SMILES:
Cc1ccc(COC(=O)N2CC[C@H](CNc3cnc(C)cn3)C(F)(F)C2)cc1
: