Target
Glutamate receptor ionotropic, NMDA 2B
Ligand
BDBM388298
Substrate
Meas. Tech.
NR2B Antagonist Activity
IC50
17.0±n/a nM
Citation
 Shapiro, G 3,3-difluoropiperidine carbamate heterocyclic compounds as NR2B NMDA receptor antagonists US Patent  US10294230 Publication Date 5/21/2019 
Target
Name:
Glutamate receptor ionotropic, NMDA 2B
Synonyms:
GRIN2B Glutamate [NMDA] receptor subunit epsilon 2 N-methyl D-aspartate receptor subtype 2B NMDAR2B NR3 | hNR3
Type:
PROTEIN
Mol. Mass.:
166375.46
Organism:
Homo sapiens (Human)
Description:
ChEMBL_1438829
Residue:
1484
  
Inhibitor
Name:
BDBM388298
Synonyms:
US10294230, Compound E1-8.2
Type:
Small organic molecule
Emp. Form.:
C20H22F2N6O2
Mol. Mass.:
416.4245
SMILES:
Cc1ccc(COC(=O)N2CC[C@@H](CNc3ncc4cn[nH]c4n3)C(F)(F)C2)cc1
: