Target
Proteasome subunit beta type-8
Ligand
BDBM388386
Substrate
Meas. Tech.
Determination of LMP7 Activity
IC50
<50±n/a nM
Citation
 Klein, MSchadt, OHaselmayer, PBusch, M Substituted boronic acids and boronate esters as immunoproteasome inhibitors US Patent  US10294246 Publication Date 5/21/2019 
Target
Name:
Proteasome subunit beta type-8
Synonyms:
26S proteosome Low molecular mass protein 7 Multicatalytic endopeptidase complex subunit C13 PSMB5i Proteasome component C13 Proteasome subunit beta-5i Y2
Type:
PROTEIN
Mol. Mass.:
30357.49
Organism:
Homo sapiens (Human)
Description:
ChEMBL_1446797
Residue:
276
  
Inhibitor
Name:
BDBM388386
Synonyms:
US10294246, Compound No. 83
Type:
Small organic molecule
Emp. Form.:
C20H22BNO5
Mol. Mass.:
367.203
SMILES:
Cc1cccc2c(C[C@H](NC(=O)[C@@H](CO)c3ccccc3)B(O)O)coc12
: