Target
Interleukin-1 receptor-associated kinase 4
Ligand
BDBM388457
Substrate
Meas. Tech.
Kinase Assay
IC50
98.0±n/a nM
Citation
 Altman, MDAndresen, BMBrubaker, JDDonofrio, AFischmann, TGibeau, CRLesburg, CALim, JMaclean, JKMansoor, UFNorthrup, ABSanders, JMSmith, GFTorres, L Inhibitors of IRAK4 activity US Patent  US9943516 Publication Date 4/17/2018 
Target
Name:
Interleukin-1 receptor-associated kinase 4
Synonyms:
IRAK-4 IRAK4_HUMAN Interleukin-1 receptor-associated kinase 4 (IRAK4) | Renal carcinoma antigen NY-REN-64
Type:
Protein
Mol. Mass.:
51519.08
Organism:
Homo sapiens (Human)
Description:
Q9NWZ3
Residue:
460
  
Inhibitor
Name:
BDBM388457
Synonyms:
4-{4-[(trans-4- morpholin-4- ylcyclohexyl)amino] quinazolin-6-yl} cyclohexanecarboxylic acid | US9943516, 3-6
Type:
Small organic molecule
Emp. Form.:
C25H34N4O3
Mol. Mass.:
438.5625
SMILES:
OC(=O)C1CCC(CC1)c1ccc2ncnc(N[C@H]3CC[C@@H](CC3)N3CCOCC3)c2c1
: