Target
Amine oxidase [flavin-containing] A
Ligand
BDBM256489
Substrate
Meas. Tech.
Biological Assay
IC50
34120±n/a nM
Citation
 Ortega Muñoz, AFyfe, MCMartinell Pedemonte, MEstiarte Martinez, MValls Vidal, NKurz, GCastro Palomino Laria, JC (Hetero)aryl cyclopropylamine compounds as LSD1 inhibitors US Patent  US9944601 Publication Date 4/17/2018 
Target
Name:
Amine oxidase [flavin-containing] A
Synonyms:
AOFA_HUMAN MAO-A Monoamine oxidase Monoamine oxidase type A (MAO A) Monoamine oxidase type A (MAOA)
Type:
Protein
Mol. Mass.:
59689.53
Organism:
Homo sapiens (Human)
Description:
P21397
Residue:
527
  
Inhibitor
Name:
BDBM256489
Synonyms:
US10329256, Example 34 US9944601, Example 34
Type:
Small organic molecule
Emp. Form.:
C15H20BrN3O
Mol. Mass.:
338.243
SMILES:
NC(=O)N1CCC(CC1)N[C@H]1C[C@@H]1c1ccc(Br)cc1
: