Target
Amine oxidase [flavin-containing] B
Ligand
BDBM256495
Substrate
Meas. Tech.
Biological Assay
IC50
35960±n/a nM
Citation
 Ortega Muñoz, AFyfe, MCMartinell Pedemonte, MEstiarte Martinez, MValls Vidal, NKurz, GCastro Palomino Laria, JC (Hetero)aryl cyclopropylamine compounds as LSD1 inhibitors US Patent  US9944601 Publication Date 4/17/2018 
Target
Name:
Amine oxidase [flavin-containing] B
Synonyms:
AOFB_HUMAN MAOB Monoamine oxidase type B (MAO B) Monoamine oxidase type B (MAOB)
Type:
Protein
Mol. Mass.:
58768.76
Organism:
Homo sapiens (Human)
Description:
P27338
Residue:
520
  
Inhibitor
Name:
BDBM256495
Synonyms:
US10329256, Example 40 US9944601, Example 40
Type:
Small organic molecule
Emp. Form.:
C19H23N3
Mol. Mass.:
293.406
SMILES:
C1[C@H](NC2CCN(CC2)c2ccncc2)[C@H]1c1ccccc1
: