Target
Cannabinoid receptor 2
Ligand
BDBM388465
Substrate
Meas. Tech.
Radioligand Binding Assay
Ki
58.7±n/a nM
Citation
 Jones, RMHan, SThoresen, LJung, JStrah-Pleynet, SZhu, XXiong, YYue, D Cannabinoid receptor modulators US Patent  US9944606 Publication Date 4/17/2018 
Target
Name:
Cannabinoid receptor 2
Synonyms:
CANNABINOID CB2 CB2 CB2B CNR2_HUMAN Cannabinoid CB2 receptor Cannabinoid receptor 2 (CB2R) | hCB2
Type:
G Protein-Coupled Receptor (GPCR)
Mol. Mass.:
39690.94
Organism:
Homo sapiens (Human)
Description:
P34972
Residue:
360
  
Inhibitor
Name:
BDBM388465
Synonyms:
(1aR,5aR)-2-(Tetrahydro-pyran-4-ylmethyl)-1a,2,5,5a-tetrahydro-1H-2,3-diaza-cyclopropa[a]pentalene-4-carboxylic acid (1-pyridin-2-yl-cyclobutyl)-amide US9944606, Compound 752
Type:
Small organic molecule
Emp. Form.:
C23H28N4O2
Mol. Mass.:
392.494
SMILES:
O=C(NC1(CCC1)c1ccccn1)c1nn(CC2CCOCC2)c2[C@@H]3C[C@@H]3Cc12
: